码上敲享录 > java常见报错解答 > Failed to execute goal org.apache.maven.plugins:maven-surefire-plugin:2.22.1:test (default-test) on

Failed to execute goal org.apache.maven.plugins:maven-surefire-plugin:2.22.1:test (default-test) on

上一章章节目录下一章 2019-09-09已有189人阅读 评论(0)

maven 打包jar报错如下:

Failed to execute goal org.apache.maven.plugins:maven-surefire-plugin:2.22.1:test (default-test) on project webscoket: There are test failures.

[ERROR]

[ERROR] Please refer to E:\items\webscoket\target\surefire-reports for the individual test results.

[ERROR] Please refer to dump files (if any exist) [date].dump, [date]-jvmRun[N].dump and [date].dumpstream.


解决方法:

从上面描述可以确定是单元测试部分有问题


方法1:在测试类上加上@Ignore注解

@RunWith(SpringRunner.class)
@SpringBootTest
@Ignore

public class WebscoketApplicationTests {


   ////.....

}


方法二:

在pom.xml文件加上依赖包

<plugin>
  <groupId>org.apache.maven.plugins</groupId>
  <artifactId>maven-surefire-plugin</artifactId>
  <version>2.22.1</version>
  <configuration>
     <skipTests>true</skipTests>
  </configuration>
</plugin>



0

有建议,请留言!

  • *您的姓名:

  • *所在城市:

  • *您的联系电话:

    *您的QQ:

  • 咨询问题:

  • 提 交